{"text_format":"1","workbook":"xlsx","n_sheets":18,"sheets":["Instructions","Revision History","Order By Size","Room Layout","Calcs","LU Table","Order BOM's","New Order BOM's","Purchase Order","Room Layout Summary","Layout Dimensions","Bulk Order Parts List","Purchase Order (RL)","Room Layout Image","Existing Comparison","Slope-Fractional","Slope-Decimal","Slope-Metric"],"not_rendered":{"charts":4,"images":5,"macros":1,"external_links":0,"defined_names":14,"comments":2,"pivot_tables":0},"unopened":[{"sheet":"Room Layout Image","index":13,"reason":"not_a_worksheet"}],"bounds":{"document_bytes":16777216,"sheet_cells":100000,"rows_first":2000,"rows_last":500,"rows_between":2000,"halvings":0,"cell_chars":16384,"cell_head_chars":4096},"cells_cut":0,"cells_raw":0,"read":"whole","date_system":"1900"}

{"sheet":"Instructions","index":0,"n_rows":25,"n_cols":2,"rows_kept":25,"cut":false,"hidden":true,"merged":[[0,0,0,1],[14,0,14,1]]}
["How to Create the Order By Size File"]
[1,"Save a copy of the master file.  Format is YYYY.MM.DD US Order By Size.xlsm.  The Date should be the same date as the master file."]
[2,"Go to the calcs tab and set Active Tool Being Used to 2.  This is the number in the red highlighted cell."]
[3,"Hide all tabs that are colored green"]
[4,"Hide all tabs that are colored gray"]
[5,"The packing list tab will stay visible"]
[6,"One at a time, apply protection to the turquoise colored tabs.  Verify options are checked like this image."]
[7,"Apply protection to the packing list tab."]
[8,"Hide the instructions tab"]
[9,"Apply protection to the entire Workbook"]
{"$rows_left_out":16}
{"sheet":"Revision History","index":1,"n_rows":11,"n_cols":5,"rows_kept":11,"cut":false,"hidden":true,"merged":[]}
["Date","File Name Date","Description","OBS File","RLO File"]
["2019-01-08","2019.01.08","Fixing a print selection area on the bulk order parts list","X","X"]
["2019-02-11","2019.02.11","Fixed the B dimension for 5' benches.  This needs to be an additional 6\" when there is a 5' Bench."]
["2019-02-11","2019.02.11","Updated part numbers that were in 10102-xxxxx format to the latest 7xxxxx format"]
["2019-02-11","2019.02.11","Upated price of Bond Three Sealant from $12 to $13"]
["2019-02-12","2019.02.12","Changed reference for B dimension to number of 5' benches, Calcs Cell F71"]
["2019-04-08","2019.04.08","Fixed BOM calculation error for individual parts for trellis mount,  thumb screw & 1\" screws.  It didn't account for the 5' bench.  Also added calculation descriptions for most of the remaing parts."]
["2019-07-22","2019.07.22","Added capability for 2', 3' & 4' end sections to the bench to provide for added capability."]
["2019-10-16","2019.10.14","Removed reference to Box Kits.  Updated calculations on the order BOM tabs.  Added new part numbers.  Changed slightly the amount of spare screws due to BOM calculation changes"]
["2019-10-29","2019.10.29","Added End Cap PN, fixed calculations.  Added 5' summary to Room Layout PO"]
{"$rows_left_out":2}
{"sheet":"Order By Size","index":2,"n_rows":32,"n_cols":6,"rows_kept":32,"cut":false,"hidden":true,"merged":[[1,4,1,8],[8,5,8,7],[7,1,7,7],[9,5,9,7],[22,5,22,7],[14,5,14,7],[15,5,15,7],[16,5,16,7],[17,5,17,7],[18,5,18,7],[23,5,23,7],[24,5,24,7],[31,1,31,3],[10,5,10,7],[11,5,11,7],[12,5,12,7],[13,5,13,7],[20,5,20,7],[21,5,21,7],[25,5,25,7],[26,5,26,7],[27,5,27,7],[28,5,28,7],[29,5,29,7]]}
[]
[null,null,null,null,"Order By Size"]
[]
[]
[]
[]
[]
[null,"Bench Selections"]
[null,"Width","Length","Height","Qty","Notes"]
[null,"4'"]
{"$rows_left_out":23}
{"sheet":"Room Layout","index":3,"n_rows":34,"n_cols":6,"rows_kept":34,"cut":false,"hidden":false,"merged":[[30,1,30,2],[30,3,30,4],[1,1,1,5],[4,0,4,5],[14,0,14,5],[20,0,20,5],[24,0,24,5],[23,3,23,4],[9,2,9,5],[10,2,10,5],[11,2,11,5],[12,2,12,5],[13,2,13,5],[9,0,9,1]]}
[]
[null,"Slide Bench Room Layout Calculator"]
[]
[]
["Room Size"]
["Room Length",100,"Feet",0,"Inches"]
["Room Width",100,"Feet",0,"Inches"]
["Rotate Room Layout 90 Degrees"]
["Number of Identical Rooms",1]
["Worksheet Name For Room Side",null,"Specific Description for Room Side"]
{"$rows_left_out":25}
{"sheet":"Calcs","index":4,"n_rows":252,"n_cols":32,"rows_kept":252,"cut":false,"hidden":true,"merged":[[2,20,2,21],[2,22,2,23],[28,9,28,12],[1,12,1,13],[0,10,0,31],[2,18,2,19],[83,0,83,6],[6,0,6,3],[32,0,32,6],[67,0,67,6],[58,2,58,3],[58,4,58,6],[35,12,35,13],[0,0,0,1],[56,0,56,6],[15,8,26,8],[16,5,16,6],[39,0,39,6],[3,8,14,8]]}
["Activate Tool Being Used",null,1,null,null,null,null,null,null,null,"Math to calculate quantities to drive PO & BOM"]
["Room Layout",1,null,null,null,null,null,null,null,null,null,null,"Length"]
["Order by Size",2,null,null,null,null,null,null,null,null,"Chart Row","Active","Length (ft)","Index#","Arch#","Height","Bench QTY","# of Rooms","# of 12 Arches",null,"# of 20 Arches",null,"# of 30 Arches",null,"Drain","Middle","5' End ","4' End ","3' End ","2' End ","+Anti-tip","Seams"]
[null,null,null,null,null,null,null,null,"4 Foot Wide","Room Layout",0,{"$f":"IF($C$1=1,1,0)","v":1},{"$f":"C53","v":99.5},null,{"$f":"VLOOKUP(C53,'LU Table'!D4:F79,3)","v":20},1,{"$f":"IF(OR(L4=0,P4=1),0,E61)","v":0},{"$f":"'Room Layout'!B9","v":1},{"$f":"IF($P4=2,1,0)","v":0},{"$f":"($O4+1)*$Q4*S4*R4","v":0},{"$f":"IF($P4=3,1,0)","v":0},{"$f":"($O4+1)*$Q4*U4*R4","v":0},{"$f":"IF($P4=4,1,0)","v":0},{"$f":"($O4+1)*$Q4*W4*R4","v":0},{"$f":"Q4*R4","v":0},{"$f":"C47*Q4*R4","v":0},{"$f":"C48*Q4*R4","v":0},{"$f":"C51*Q4*R4","v":0},{"$f":"C50*Q4*R4","v":0},{"$f":"C49*Q4*R4","v":0},{"$f":"VLOOKUP(C53,'LU Table'!D4:L79,9)*Q4*R4","v":0},{"$f":"(O4-1)*Q4*R4","v":0}]
[null,null,null,null,null,null,null,null,null,"Order by Size",1,{"$f":"IF($C$1=1,0,1)","v":0},{"$f":"VLOOKUP(N5,LookUp,2)","v":"--"},1,{"$f":"VLOOKUP(N5,'LU Table'!$C$3:$F$79,4)","v":0},1,{"$f":"IF(OR(N5=1,P5=1,L5=0),0,'Order By Size'!E10)","v":0},"NA",{"$f":"IF($P5=2,1,0)","v":0},{"$f":"($O5+1)*$Q5*S5","v":0},{"$f":"IF($P5=3,1,0)","v":0},{"$f":"($O5+1)*$Q5*U5","v":0},{"$f":"IF($P5=4,1,0)","v":0},{"$f":"($O5+1)*$Q5*W5","v":0},{"$f":"Q5","v":0},{"$f":"VLOOKUP(N5,LookUp,5)*Q5","v":0},{"$f":"VLOOKUP(N5,LookUp,6)*Q5","v":0},{"$f":"VLOOKUP(N5,LookUp,7)*Q5","v":0},{"$f":"VLOOKUP(N5,LookUp,8)*Q5","v":0},{"$f":"VLOOKUP(N5,LookUp,9)*Q5","v":0},{"$f":"VLOOKUP(N5,LookUp,10)*Q5","v":0},{"$f":"(O5-1)*Q5","v":0}]
[null,null,null,null,null,null,null,null,null,"Order by Size",2,0,"--",1,{"$f":"VLOOKUP(N6,'LU Table'!$C$3:$F$79,4)","v":0},1,{"$f":"IF(OR(N6=1,P6=1,L6=0),0,'Order By Size'!E11)","v":0},"NA",0,{"$f":"($O6+1)*$Q6*S6","v":0},0,{"$f":"($O6+1)*$Q6*U6","v":0},0,{"$f":"($O6+1)*$Q6*W6","v":0},{"$f":"Q6","v":0},0,0,0,0,0,0,0]
["Bench Design Parameters",null,null,null,null,null,null,null,null,"Order by Size",3,0,"--",1,{"$f":"VLOOKUP(N7,'LU Table'!$C$3:$F$79,4)","v":0},1,{"$f":"IF(OR(N7=1,P7=1,L7=0),0,'Order By Size'!E12)","v":0},"NA",0,0,0,0,0,0,0,0,0,0,0,0,0,0]
[null,null,"4'","5'",null,null,null,null,null,"Order by Size",4,0,"--",1,{"$f":"VLOOKUP(N8,'LU Table'!$C$3:$F$79,4)","v":0},1,{"$f":"IF(OR(N8=1,P8=1,L8=0),0,'Order By Size'!E13)","v":0},"NA",0,0,0,0,0,0,0,0,0,0,0,0,0,0]
["Bench Widths, Max Outside Dim","[in]",48,60,null,null,null,null,null,"Order by Size",5,0,"--",1,{"$f":"VLOOKUP(N9,'LU Table'!$C$3:$F$79,4)","v":0},1,{"$f":"IF(OR(N9=1,P9=1,L9=0),0,'Order By Size'!E14)","v":0},"NA",0,0,0,0,0,0,0,0,0,0,0,0,0,0]
["Width Border, Per Side","[in]",1.77,1.77,null,null,null,null,null,"Order by Size",6,0,"--",1,{"$f":"VLOOKUP(N10,'LU Table'!$C$3:$F$79,4)","v":0},1,{"$f":"IF(OR(N10=1,P10=1,L10=0),0,'Order By Size'!E15)","v":0},"NA",0,0,0,0,0,0,{"$f":"Q10","v":0},0,0,0,0,0,0,0]
{"$rows_left_out":243}
{"sheet":"LU Table","index":5,"n_rows":79,"n_cols":14,"rows_kept":79,"cut":false,"hidden":true,"merged":[[0,2,0,13]]}
["Range Name",null,"Index & Lookup Table"]
["Lookup",null,"Index #","Length","Length","# Arches","# Mid Trays","5'L End","4'L End","3'L End","2'L End","+Antitip","Height","Widths"]
["ArchHeight",null,1,"--","--",0,0,0,0,0,0,0,"--","4' Only"]
["Widths",null,2,7.5,"7' 6\"",2,0,0,0,0,1,0,"12\"","5' Only"]
[null,null,3,8.5,"8' 6\"",2,0,0,0,1,0,0,"20\"","4' & 5' Mixed"]
[null,null,4,9.5,"9' 6\"",2,0,0,1,0,0,0,"30\""]
[null,null,5,10.5,"10' 6\"",2,0,1,0,0,0,0]
[null,null,6,12.5,"12' 6\"",3,1,0,0,0,1,0]
[null,null,7,13.5,"13' 6\"",3,1,0,0,1,0,0]
[null,null,8,14.5,"14' 6\"",3,1,0,1,0,0,0]
{"$rows_left_out":70}
{"sheet":"Order BOM's","index":6,"n_rows":94,"n_cols":12,"rows_kept":94,"cut":false,"hidden":true,"merged":[[0,1,0,5],[22,1,22,4],[0,7,0,10],[67,7,67,10]]}
[null,"Top Level Order BOM",null,null,null,null,null,"Screw Kits"]
["Transfer Filter","SKU","Description","Order Qty","Resale Price","Notes",null,"SKU","Description","Order Qty","Notes"]
[{"$f":"IF(D3=0,0,1)","v":0},"HGC705997","4' Slide Bench Drain Kit",{"$f":"Calcs!Y15","v":0},284.16000000000003]
[{"$f":"IF(D4=0,0,MAX(A3)+1)","v":0},"HGC705998","4' Slide Bench Middle Kit",{"$f":"Calcs!Z15","v":0},284.16000000000003,null,null,"LC3165","Arch Screw Kit",1,"1 pkg for each 12\", 20\" & 30\" arch kit","LC3642 will replace"]
[{"$f":"IF(D5=0,0,MAX($A$3:A4)+1)","v":0},"HGC705999","4' Slide Bench 5' Long End Kit",{"$f":"Calcs!AA15","v":0},284.16000000000003,null,null,"MS3271","SCREW - HEX HD, FLNG, 1/4\"-20 UNC X 3/8\"",4]
[{"$f":"IF(D6=0,0,MAX($A$3:A5)+1)","v":0},"HGC706156","4' End Tray, 4' Long End Kit",{"$f":"Calcs!AB15","v":0},244.73,null,null,"MS3255","NUT-HEX, 5/8\"-11 UNC-2B",4,null,"Eliminate"]
[{"$f":"IF(D7=0,0,MAX($A$3:A6)+1)","v":0},"HGC706157","4' End Tray, 3' Long End Kit",{"$f":"Calcs!AC15","v":0},222.48,null,null,"MS3256","Wshr, 11/16\" ID",4,null,"Eliminate"]
[{"$f":"IF(D8=0,0,MAX($A$3:A7)+1)","v":0},"HGC706158","4' End Tray, 2' Long End Kit",{"$f":"Calcs!AD15","v":0},210.24]
[{"$f":"IF(D9=0,0,MAX($A$3:A8)+1)","v":0},"HGC705994","5' Slide Bench Drain Kit",{"$f":"Calcs!Y27","v":0},383.83]
[{"$f":"IF(D10=0,0,MAX($A$3:A9)+1)","v":0},"HGC705995","5' Slide Bench Middle Kit",{"$f":"Calcs!Z27","v":0},383.83,null,null,"LC3166","Tube Screw Kit",1,"1 pkg for each short tube & long tube kit"]
{"$rows_left_out":85}
{"sheet":"New Order BOM's","index":7,"n_rows":457,"n_cols":8,"rows_kept":457,"cut":false,"hidden":true,"merged":[]}
["Transfer Filter","Virtual SKU Designation","SAP Description (40 character max)","WS Price (USD)","MSRP (USD)","WS Price (CAD)","MSRP (CAD)"]
[{"$f":"IF(H2=0,0,1)","v":{"$error":"#N/A"}},"SB48-90-12B","SLIDE BENCH: 4FTx7.5FTx12INxB",651.58000000000004,1009.2,814.48,1261.5,{"$f":"_xlfn.IFS(B2=Calcs!$R$38,Calcs!$Q$38,B2=Calcs!$R$39,Calcs!$Q$39,TRUE,0)","v":{"$error":"#N/A"}}]
[{"$f":"IF(H3=0,0,MAX(A2)+1)","v":{"$error":"#N/A"}},"SB48-102-12B","SLIDE BENCH: 4FTx8.5FTx12INxB",663.82,1027,829.78,1283.75,{"$f":"_xlfn.IFS(B3=Calcs!$R$38,Calcs!$Q$38,B3=Calcs!$R$39,Calcs!$Q$39,TRUE,0)","v":{"$error":"#N/A"}}]
[{"$f":"IF(H4=0,0,MAX($A$2:A3)+1)","v":{"$error":"#N/A"}},"SB48-114-12B","SLIDE BENCH: 4FTx9.5FTx12INxB",686.07,1060.3699999999999,857.59,1325.46,{"$f":"_xlfn.IFS(B4=Calcs!$R$38,Calcs!$Q$38,B4=Calcs!$R$39,Calcs!$Q$39,TRUE,0)","v":{"$error":"#N/A"}}]
[{"$f":"IF(H5=0,0,MAX($A$2:A4)+1)","v":{"$error":"#N/A"}},"SB48-126-12B","SLIDE BENCH: 4FTx10.5FTx12INxB",725.5,1123.24,906.88,1404.05,{"$f":"_xlfn.IFS(B5=Calcs!$R$38,Calcs!$Q$38,B5=Calcs!$R$39,Calcs!$Q$39,TRUE,0)","v":{"$error":"#N/A"}}]
[{"$f":"IF(H6=0,0,MAX($A$2:A5)+1)","v":{"$error":"#N/A"}},"SB48-150-12B","SLIDE BENCH: 4FTx12.5FTx12INxB",983.17,1522.44,1228.96,1903.05,{"$f":"_xlfn.IFS(B6=Calcs!$R$38,Calcs!$Q$38,B6=Calcs!$R$39,Calcs!$Q$39,TRUE,0)","v":{"$error":"#N/A"}}]
[{"$f":"IF(H7=0,0,MAX($A$2:A6)+1)","v":{"$error":"#N/A"}},"SB48-162-12B","SLIDE BENCH: 4FTx13.5FTx12INxB",995.41,1540.24,1244.26,1925.3,{"$f":"_xlfn.IFS(B7=Calcs!$R$38,Calcs!$Q$38,B7=Calcs!$R$39,Calcs!$Q$39,TRUE,0)","v":{"$error":"#N/A"}}]
[{"$f":"IF(H8=0,0,MAX($A$2:A7)+1)","v":{"$error":"#N/A"}},"SB48-174-12B","SLIDE BENCH: 4FTx14.5FTx12INxB",1017.66,1573.61,1272.08,1967.01,{"$f":"_xlfn.IFS(B8=Calcs!$R$38,Calcs!$Q$38,B8=Calcs!$R$39,Calcs!$Q$39,TRUE,0)","v":{"$error":"#N/A"}}]
[{"$f":"IF(H9=0,0,MAX($A$2:A8)+1)","v":{"$error":"#N/A"}},"SB48-186-12B","SLIDE BENCH: 4FTx15.5FTx12INxB",1057.0899999999999,1636.48,1321.36,2045.6,{"$f":"_xlfn.IFS(B9=Calcs!$R$38,Calcs!$Q$38,B9=Calcs!$R$39,Calcs!$Q$39,TRUE,0)","v":{"$error":"#N/A"}}]
[{"$f":"IF(H10=0,0,MAX($A$2:A9)+1)","v":{"$error":"#N/A"}},"SB48-210-12B","SLIDE BENCH: 4FTx17.5FTx12INxB",1335.49,2067.6999999999998,1669.36,2584.63,{"$f":"_xlfn.IFS(B10=Calcs!$R$38,Calcs!$Q$38,B10=Calcs!$R$39,Calcs!$Q$39,TRUE,0)","v":{"$error":"#N/A"}}]
{"$rows_left_out":448}
{"sheet":"Purchase Order","index":8,"n_rows":39,"n_cols":10,"rows_kept":39,"cut":false,"hidden":false,"merged":[[39,1,41,9],[25,2,25,6],[4,4,4,8],[15,2,15,6],[16,2,16,6],[17,2,17,6],[18,2,18,6],[19,2,19,6],[20,2,20,6],[21,2,21,6],[22,2,22,6],[23,2,23,6],[24,2,24,6],[36,1,36,7],[36,8,36,9],[26,2,26,6],[27,2,27,6],[33,2,33,6],[34,1,34,7],[34,8,34,9],[35,1,35,7],[35,8,35,9],[28,2,28,6],[29,2,29,6],[30,2,30,6],[31,2,31,6],[32,2,32,6]]}
[]
[]
[]
[]
[null,"Hawthorne Hydroponics",null,null,"Order Information"]
[null,"3204 NW 38th Circle",null,null,"Order Date:"]
[null,"Vancouver, WA 98660",null,null,"Requested Delivery Date:"]
[null,"Phone  877-753-0404",null,null,"Customer P.O.:"]
[]
[null,"Payer:",null,null,"Bill To:",null,null,"Ship To:"]
{"$rows_left_out":30}
{"sheet":"Room Layout Summary","index":9,"n_rows":35,"n_cols":8,"rows_kept":35,"cut":false,"hidden":false,"merged":[[31,4,31,5],[31,6,31,7],[31,0,31,2]]}
[]
[]
[]
[]
[]
[]
[]
[]
[]
[]
{"$rows_left_out":26}
{"sheet":"Layout Dimensions","index":10,"n_rows":9,"n_cols":7,"rows_kept":9,"cut":false,"hidden":false,"merged":[[6,1,8,1],[2,1,2,4],[1,6,1,18]]}
[]
[null,null,null,null,null,null,"Slide Bench Room Layout Dimensions"]
[null,"Dimensions"]
[null,"A",{"$f":"Calcs!C85","v":5.125},"in"]
[null,"B",{"$f":"Calcs!C86","v":19.25},"in"]
[null,"L",{"$f":"Calcs!C90","v":1182},"in"]
[null,"C ",{"$f":"Calcs!C87","v":48},"in","4' to 4' Bench"]
[null,null,{"$f":"Calcs!C88","v":54},"in","4' to 5' Bench"]
[null,null,{"$f":"Calcs!C89","v":60},"in","5' to 5' Bench"]

{"sheet":"Bulk Order Parts List","index":11,"n_rows":70,"n_cols":8,"rows_kept":70,"cut":false,"hidden":true,"merged":[[1,4,1,8]]}
[]
[null,null,null,null,"Bulk Order Parts List"]
[]
[null,"Sold By:",null,null,"Ship To:"]
[null,"name",null,null,"name"]
[null,"address 1",null,null,"address 1"]
[null,"address 2",null,null,"address 2"]
[null,"city, state, zip",null,null,"city, state, zip"]
[]
[null,"Stock Number","Description",null,null,null,null,"Quantity"]
{"$rows_left_out":61}
{"sheet":"Purchase Order (RL)","index":12,"n_rows":52,"n_cols":10,"rows_kept":52,"cut":false,"hidden":true,"merged":[[51,2,51,4],[36,1,36,7],[36,8,36,9],[39,1,43,9],[48,3,48,4],[47,3,47,4],[49,3,49,4],[34,8,34,9],[35,1,35,7],[35,8,35,9],[20,2,20,6],[21,2,21,6],[22,2,22,6],[23,2,23,6],[24,2,24,6],[25,2,25,6],[26,2,26,6],[27,2,27,6],[33,2,33,6],[34,1,34,7],[28,2,28,6],[29,2,29,6],[30,2,30,6],[31,2,31,6],[32,2,32,6],[19,2,19,6],[4,4,4,8],[15,2,15,6],[16,2,16,6],[17,2,17,6],[18,2,18,6]]}
[]
[]
[]
[]
[null,"Hawthorne Hydroponics",null,null,"Order Information"]
[null,"3204 NW 38th Circle",null,null,"Order Date:"]
[null,"Vancouver, WA 98660",null,null,"Requested Delivery Date:"]
[null,"Phone  877-753-0404",null,null,"Customer P.O.:"]
[]
[null,"Payer:",null,null,"Bill To:",null,null,"Ship To:"]
{"$rows_left_out":43}
{"sheet":"Existing Comparison","index":14,"n_rows":16,"n_cols":6,"rows_kept":16,"cut":false,"hidden":true,"merged":[[12,1,12,2],[12,3,12,4],[16,1,16,2],[16,3,16,4],[13,1,13,2],[13,3,13,4],[14,1,14,2],[14,3,14,4],[15,1,15,2],[15,3,15,4],[8,1,8,2],[8,3,8,4],[9,1,9,2],[9,3,9,4],[11,0,11,5],[1,3,1,5],[7,1,7,2],[7,3,7,4],[5,0,5,5],[6,1,6,2],[6,3,6,4]]}
[]
[null,null,null,"Room Comparison"]
[]
[]
[]
["Existing Installation"]
["Number of Benches",0,null,"#"]
["Bench Length ",0,null,"Inches"]
["Tray Width ",0,null,"Inches"]
["Bench Area",{"$f":"((B9*B8)/144)*B7","v":0},null,"Sq Feet"]
{"$rows_left_out":7}
{"sheet":"Slope-Fractional","index":15,"n_rows":24,"n_cols":20,"rows_kept":24,"cut":false,"hidden":true,"merged":[[0,0,0,19],[1,0,2,0],[1,1,1,19]]}
["Arch Height Adjustment Distance for Slope (Fractional Inches)"]
["Arch Number","Nominal Bench Length (ft)"]
[null,10,15,20,25,30,35,40,45,50,55,60,65,70,75,80,85,90,95,100]
["1\n(Drain)",0,0,0,0,0,0,0,0,0,0,0,0,0,0,0,0,0,0,0]
[2,"5/8","5/8","5/8","5/8","5/8","5/8","5/8","9/16","1/2","7/16","7/16","3/8","3/8","5/16","5/16","5/16","1/4","1/4","1/4"]
[3,"1  1/4","1  1/4","1  1/4","1  1/4","1  1/4","1  1/4","1  1/4","1  1/8",1,"15/16","13/16","3/4","3/4","11/16","5/8","9/16","9/16","1/2","1/2"]
[4,null,"1  7/8","1  7/8","1  7/8","1  7/8","1  7/8","1  7/8","1  11/16","1  1/2","1  3/8","1  1/8","1  1/8","1  1/16",1,"15/16","7/8","13/16","13/16","3/4"]
[5,null,null,"2  1/2","2  1/2","2  1/2","2  1/2","2  1/2","2  1/4",2,"1  13/16","1  11/16","1  9/16","1  7/16","1  5/16","1  1/4","1  3/16","1  1/8","1  1/16",1]
[6,null,null,null,"3  1/8","3  1/8","3  1/8","3  1/8","2  3/4","2  1/2","2  1/4","2  1/16","1  15/16","1  13/16","1  11/16","1  5/8","1  1/2","1  3/8","1  5/16","1  1/4"]
[7,null,null,null,null,"3  3/4","3  3/4","3  3/4","3  5/16",3,"2  3/4","2  1/2","2  5/16","2  1/8",1.9999999999999998,"1  7/8","1  3/4","1  11/16","1  9/16","1  1/2"]
{"$rows_left_out":15}
{"sheet":"Slope-Decimal","index":16,"n_rows":24,"n_cols":20,"rows_kept":24,"cut":false,"hidden":true,"merged":[[0,0,0,19],[1,0,2,0],[1,1,1,19]]}
["Arch Height Adjustment Distance for Slope (Decimal Inches)"]
["Arch Number","Nominal Bench Length(ft)"]
[null,10,15,20,25,30,35,40,45,50,55,60,65,70,75,80,85,90,95,100]
["1\n(Drain)",0,0,0,0,0,0,0,0,0,0,0,0,0,0,0,0,0,0,0]
[2,0.625,0.625,0.625,0.625,0.625,0.625,0.625,0.55555555555555558,0.5,0.45454545454545453,0.41666666666666669,0.38461538461538464,0.35714285714285715,0.33333333333333331,0.3125,0.29411764705882354,0.27777777777777779,0.26315789473684209,0.25]
[3,1.25,1.25,1.25,1.25,1.25,1.25,1.25,1.1111111111111112,1,0.90909090909090906,0.83333333333333337,0.76923076923076927,0.7142857142857143,0.66666666666666663,0.625,0.58823529411764708,0.55555555555555558,0.52631578947368418,0.5]
[4,null,1.875,1.875,1.875,1.875,1.875,1.875,1.6666666666666667,1.5,1.3636363636363635,1.25,1.153846153846154,1.0714285714285714,1,0.9375,0.88235294117647056,0.83333333333333337,0.78947368421052633,0.75]
[5,null,null,2.5,2.5,2.5,2.5,2.5,2.2222222222222223,2,1.8181818181818181,1.6666666666666667,1.5384615384615385,1.4285714285714286,1.3333333333333333,1.25,1.1764705882352942,1.1111111111111112,1.0526315789473684,1]
[6,null,null,null,3.125,3.125,3.125,3.125,2.7777777777777777,2.5,2.2727272727272725,2.0833333333333335,1.9230769230769231,1.7857142857142858,1.6666666666666665,1.5625,1.4705882352941178,1.3888888888888888,1.3157894736842104,1.25]
[7,null,null,null,null,3.75,3.75,3.75,3.333333333333333,3,2.7272727272727271,2.5,2.3076923076923079,2.1428571428571428,1.9999999999999998,1.875,1.7647058823529413,1.6666666666666665,1.5789473684210524,1.5]
{"$rows_left_out":15}
{"sheet":"Slope-Metric","index":17,"n_rows":24,"n_cols":20,"rows_kept":24,"cut":false,"hidden":true,"merged":[[0,0,0,19],[1,0,2,0],[1,1,1,19]]}
["Arch Height Adjustment Distance for Slope (mm)"]
["Arch Number","Nominal Bench Length (ft)"]
[null,10,15,20,25,30,35,40,45,50,55,60,65,70,75,80,85,90,95,100]
["1\n(Drain)",0,0,0,0,0,0,0,0,0,0,0,0,0,0,0,0,0,0,0]
[2,15.875,15.875,15.875,15.875,15.875,15.875,15.875,14.111111111111111,12.7,11.545454545454545,10.583333333333334,9.7692307692307701,9.0714285714285712,8.466666666666665,7.9375,7.4705882352941178,7.0555555555555554,6.6842105263157885,6.35]
[3,31.75,31.75,31.75,31.75,31.75,31.75,31.75,28.222222222222221,25.4,23.09090909090909,21.166666666666668,19.53846153846154,18.142857142857142,16.93333333333333,15.875,14.941176470588236,14.111111111111111,13.368421052631577,12.7]
[4,null,47.625,47.625,47.625,47.625,47.625,47.625,42.333333333333336,38.099999999999994,34.636363636363633,31.75,29.30769230769231,27.214285714285712,25.4,23.8125,22.411764705882351,21.166666666666668,20.052631578947366,19.049999999999997]
[5,null,null,63.5,63.5,63.5,63.5,63.5,56.444444444444443,50.8,46.18181818181818,42.333333333333336,39.07692307692308,36.285714285714285,33.86666666666666,31.75,29.882352941176471,28.222222222222221,26.736842105263154,25.4]
[6,null,null,null,79.375,79.375,79.375,79.375,70.555555555555543,63.5,57.72727272727272,52.916666666666664,48.846153846153847,45.357142857142854,42.333333333333329,39.6875,37.352941176470587,35.277777777777771,33.421052631578945,31.75]
[7,null,null,null,null,95.25,95.25,95.25,84.666666666666657,76.199999999999989,69.272727272727266,63.5,58.61538461538462,54.428571428571423,50.79999999999999,47.625,44.82352941176471,42.333333333333329,40.105263157894733,38.099999999999994]
{"$rows_left_out":14}